{"text_format":"1","workbook":"xlsx","n_sheets":18,"sheets":["Instructions","Overview","Core programme info","Step 1 Profile","Step 1 Profile summary","Select activities","Step 2 EAM","Risk Register","Incidents","Learn more","Glossary","Mitigation options","Compensation-Enhancement","Risk matrix","Response library","Response calculation","Risk Matrix formulae","Profile Statements"],"not_rendered":{"charts":0,"images":70,"macros":1,"external_links":0,"defined_names":558,"comments":1,"pivot_tables":0},"unopened":[],"bounds":{"document_bytes":16777216,"sheet_cells":100000,"rows_first":2000,"rows_last":500,"rows_between":2000,"halvings":0,"cell_chars":16384,"cell_head_chars":4096},"cells_cut":0,"cells_raw":0,"read":"whole","date_system":"1900"}

{"sheet":"Instructions","index":0,"n_rows":2,"n_cols":17,"rows_kept":2,"cut":false,"hidden":false,"merged":[]}
["GREEN FIELD TOOL: Mine Action and Disarmament Operations - Version: March 2025 - 1.0"]
["INSTRUCTIONS",null,null,null,null,null,null,null,null,null,null,null,null,null,null,null,"CLICK HERE FOR NEXT"]

{"sheet":"Overview","index":1,"n_rows":34,"n_cols":16,"rows_kept":34,"cut":false,"hidden":false,"merged":[]}
["GREEN FIELD TOOL: Mine Action and Disarmament Operations - Version: March 2025 - 1.0"]
["OVERVIEW",null,null,null,null,null,null,null,null,null,null,null,null,null,null,"CLICK HERE FOR NEXT"]
[]
[null,"Why is the Green Field Tool needed? ",null,null,null,null,null,null,null,null,"How to use and complete the Green Field Tool?"]
[]
[]
{"$rows_left_out":29}
{"sheet":"Core programme info","index":2,"n_rows":33,"n_cols":5,"rows_kept":33,"cut":false,"hidden":false,"merged":[[28,6,32,6],[4,0,4,3],[6,0,9,0],[6,6,9,6],[10,0,19,0],[10,6,19,6],[20,0,27,0],[28,0,32,0]]}
["GREEN FIELD TOOL: Mine Action and Disarmament Operations - Version: March 2025 - 1.0"]
["CORE PROGRAMME INFORMATION",null,"CLICK HERE FOR NEXT",null,"CLICK HERE FOR NEXT"]
["LOCATION (Country/Region):",null,"Completed by:"]
[null,null,"Date completed:"]
["Provide core information relating to any national mine action environmental policy, organisational environmental policy, relevant environmental regulation, donor and other key engagement stakeholders requirements. Complete this for each programme, including links to relevant documentation"]
["SUBJECT","QUESTION",null,"RESPONSE","Include further details and links, where applicable "]
{"$rows_left_out":28}
{"sheet":"Step 1 Profile","index":3,"n_rows":62,"n_cols":8,"rows_kept":62,"cut":false,"hidden":false,"merged":[[24,0,29,0],[32,0,48,0],[49,0,61,0],[5,6,6,6],[5,7,6,7],[20,0,21,0],[22,0,23,0],[5,8,6,8],[11,0,14,0],[11,8,12,8],[15,0,19,0],[15,8,16,8],[2,3,2,5],[3,3,3,5],[4,0,4,4],[5,0,6,0],[5,1,6,1],[5,3,5,5]]}
["GREEN FIELD TOOL: Mine Action and Disarmament Operations - Version: March 2025 - 1.0"]
["STEP 1 : ENVIRONMENTAL PROFILE",null," CLICK HERE FOR NEXT",null,null,null,null," CLICK HERE FOR NEXT"]
["LOCATION (District/village):",null,"Completed by:"]
["Co-ordinates:",null,"Date completed:"]
["Complete this environmental profile to provide baseline information on the environmental setting of the area, including ecologically important or any protected or conservation areas, vegetation cover, water resources etc. This then informs the evaluation of the risk in STEP 2, and can be provided in any handover reports to inform others.",null,null,null,null,null,"Open source data can be used to help answer some questions. The GREEN FIELD TOOL - OPEN SOURCE APPLICATION can be used to access useful datasets  "]
["SUBJECT","QUESTION",null,"Sources?",null,null,"RESPONSE","Include further details and links, \nwhere applicable "]
{"$rows_left_out":57}
{"sheet":"Step 1 Profile summary","index":4,"n_rows":60,"n_cols":6,"rows_kept":60,"cut":false,"hidden":false,"merged":[[4,1,4,5],[1,1,1,3],[0,1,0,5]]}
[null,"GREENFIELD TOOL: Mine Action and Disarmament Operations - Version: March 2025 - 1.0"]
[null,"STEP 1 : ENVIRONMENTAL PROFILE SUMMARY",null,null,null," CLICK HERE FOR NEXT"]
[null,{"$f":"'Step 1 Profile'!A3","v":"LOCATION (District/village):"},null,{"$f":"LOCATION__DISTRICT_VILLAGE","v":0}]
[null,{"$f":"'Step 1 Profile'!A4","v":"Co-ordinates:"},null,{"$f":"EP_coordinates","v":0}]
[null,"On completing STEP 1, a profile summary is generated by the GFT. This profile summary flags environmental concerns identified, grouping them into issues of High, Medium or Lower concern depending on the location and conditions. This profile summary gives a list of 'profile statements' which help in considering the environmental 'sensitivity' of an area in Step 2, when assessing the risk to the environment from mine action activities. Environmental profile information can also be provided in any handover reports."]
[null,"Issues of high concern",null,"Issues of medium concern",null,"Issues of lower concern"]
{"$rows_left_out":55}
{"sheet":"Select activities","index":5,"n_rows":14,"n_cols":3,"rows_kept":14,"cut":false,"hidden":false,"merged":[]}
["GREENFIELD TOOL: Mine Action and Disarmament Operations Version 2025.1"]
["SELECT ACTIVITIES: SCREEN OUT (OR EXCLUDE) ACTIVITIES WHICH DO NOT APPLY",null," CLICK HERE FOR NEXT"]
["LOCATION (Work area):"]
["Co-ordinates:"]
["Completed by:"]
["Date completed:"]
{"$rows_left_out":9}
{"sheet":"Step 2 EAM","index":6,"n_rows":46,"n_cols":18,"rows_kept":46,"cut":false,"hidden":false,"merged":[[44,16,45,16],[44,0,45,0],[44,11,45,11],[44,13,45,13],[44,14,45,14],[44,15,45,15],[38,0,40,0],[38,11,40,11],[38,13,40,13],[38,14,40,14],[38,15,40,15],[30,0,33,0],[30,11,33,11],[30,13,33,13],[30,14,33,14],[30,15,33,15],[34,0,37,0],[34,11,37,11],[34,13,37,13],[34,14,37,14],[34,15,37,15],[21,0,27,0],[21,11,27,11],[21,13,27,13],[21,14,27,14],[21,15,27,15],[28,0,29,0],[28,11,29,11],[28,13,29,13],[28,14,29,14],[28,15,29,15],[18,0,19,0],[18,11,19,11],[18,13,19,13],[18,14,19,14],[18,15,19,15],[15,0,17,0],[15,11,17,11],[15,13,17,13],[15,14,17,14],[15,15,17,15],[12,0,14,0],[12,11,14,11],[12,13,14,13],[12,14,14,14],[12,15,14,15],[7,0,11,0],[7,11,11,11],[7,13,11,13],[7,14,11,14],[7,15,11,15],[4,0,4,5],[5,2,6,2],[5,10,6,10],[5,11,6,11],[5,14,6,14],[7,16,11,16],[12,16,14,16],[15,16,17,16],[18,16,19,16],[38,16,40,16],[21,16,27,16],[28,16,29,16],[30,16,33,16],[34,16,37,16]]}
["GREENFIELD TOOL: Mine Action and Disarmament Operations - Version: March 2025 - 1.0"]
["STEP 2 : ENVIRONMENTAL ASSESSMENT & MONITORING",null," CLICK HERE FOR NEXT",null,null,null,null,null,null,null,null,null,null,null,null,null,null," CLICK HERE FOR NEXT"]
["LOCATION (Work Area):",{"$f":"LOCATION__WORK_AREA","v":0},"Co-ordinates:",{"$f":"step2_coord","v":0}]
["Task type/field activity:",null,"Completed by:",null,"Date completed:"]
["Complete this before mobilising and commencing mine action operations, then reviewed at the beginning of work. \nThis should be kept under review during tasks."]
["Environmental aspect","Environmental impact","Is relevant for the planned task(s)?\nIf not, select \"X\" and screen it out.","When would this impact occur?","Would the impact be temporary or permanent?","Likelihood of occuring","Severity of impact","Significance - risk level","Are risk prevention and mitigation measures needed?",null,"Is this covered in SOPs?","Add any further detail here - include any other measures in place but not listed earlier\n","With these measures in place, what is the residual risk?","Are there other measures which could be applied but are not possible?","\nGive brief details here:\n","Are any compensation, or other enhancement measures being applied or planned?","List any compensation or enhancement measures applied or planned ","Risk owner"]
{"$rows_left_out":41}
{"sheet":"Risk Register","index":7,"n_rows":46,"n_cols":16,"rows_kept":46,"cut":false,"hidden":false,"merged":[[2,1,2,4],[3,1,3,2],[4,0,4,6],[1,5,1,6],[0,0,0,5]]}
["GREENFIELD TOOL: Mine Action and Disarmament Operations - Version: March 2025 - 1.0"]
["RISK REGISTER AND ISSUES LOG",null,null,null,null," CLICK HERE FOR NEXT",null,null,null,null,null,null,null,null,null," CLICK HERE FOR NEXT"]
[{"$f":"'Step 2 EAM'!A3","v":"LOCATION (Work Area):"},{"$f":"LOCATION__WORK_AREA","v":0},null,null,null,"Co-ordinates:",{"$f":"step2_coord","v":0}]
["Completed by:",null,null,null,null,"Date completed:"]
["The risk register summarises the environmental risks and measures in place. It also allows for enhancement or compensation initiatives to be recorded, and the overall issues and outcomes."]
["Environmental impact\n","Significance - risk level","Covered in SOPs?","Control measures required?","With measures in place, what is the residual risk?","Are there other measures which could be applied but are not possible?","Details:","Not relevant","Are any compensation, or other enhancement measures being applied or planned?","Compensation or enhancement measures in place, or planned","Are controls in place effective?","Is further action required?","What is the estimated scale of the potential benefit?","What is the estimated overall outcome?","Date closed","Risk owner"]
{"$rows_left_out":41}
{"sheet":"Incidents","index":8,"n_rows":23,"n_cols":3,"rows_kept":23,"cut":false,"hidden":false,"merged":[[2,0,3,1]]}
["GREENFIELD TOOL: Mine Action and Disarmament Operations - Version: March 2025 - 1.0"]
["INCIDENT REPORTING","CLICK to Learn More"]
["This is a template which can be used to record any environmental incident noted during or on completion of field work. "]
[]
["Subject","Incident #001","ADD COLUMNS AS REQUIRED "]
["Location of incident"]
{"$rows_left_out":18}
{"sheet":"Learn more","index":9,"n_rows":77,"n_cols":6,"rows_kept":77,"cut":false,"hidden":false,"merged":[[9,0,10,0],[17,0,18,0],[2,0,2,2],[3,2,3,5]]}
["GREENFIELD TOOL: Mine Action and Disarmament Operations - Version: March 2025 - 1.0"]
["LEARN MORE"]
["This gives further explanation on why the information requested is relevant, how it relates to mine action and why it is important to understand. \nSome additional useful links are also included. "]
["Topic","Why is this is relevant?","Further information and useful links to find out more.  \nImages provided for illustrative purposes only (click on image to see image credits)."]
["National and regional legislation on climate change and the environment, including permits and licences","National, regional or local environmental legislation relevant for mine action can be wide ranging, including: \nair quality, climate change, contamination and the protection of soil, conservation and the protection of endangered species, formal Environmental Impact Assessment, protection of historic and cultural heritage, noise and ground shocks/vibration, planning and development, management of waste and wastewater, protection and use of water resources.\nFailure to comply could result in a loss of reputation, programme delays, or even fines and prosecution.  \nConsultation with regulators and local authorities is essential.  \n","FAOLEX is a FAO database of national legislation, policies and bilateral agreements "]
["Waste management infrastructure ","Waste management infrastructure ranges from waste storage and collection systems, through to waste sorting, recycling and disposal facilities. Poor, ineffective or non-existent waste management causes air pollution, water and soil contamination. This includes the use of open and non-engineered landfill sites, illegal dumping, the open burning and incineration of waste, or in some cases informal recycling.","Solid waste management guidance - sector specific guidelines for the Red Cross Red Crescent"]
{"$rows_left_out":72}
{"sheet":"Glossary","index":10,"n_rows":81,"n_cols":3,"rows_kept":81,"cut":false,"hidden":false,"merged":[]}
["GREENFIELD TOOL: Mine Action and Disarmament Operations - Version: March 2025 - 1.0"]
["GLOSSARY "]
[]
["Term","Definition","Example.  \nImages provided for illustrative purposes only (click on image to see image credits)."]
["access","access via footpaths, roads and bridges"]
["acidic soil","pH gives an indication of soil acidity, and will vary due to natural processes and conditions. Soils with a pH below 7 are acidic. Trace elements and contaminants can be more mobile and available for uptake by plants and microbes in acidic soils"]
{"$rows_left_out":76}
{"sheet":"Mitigation options","index":11,"n_rows":388,"n_cols":3,"rows_kept":388,"cut":false,"hidden":false,"merged":[[2,0,2,16383]]}
["GREENFIELD TOOL: Mine Action and Disarmament Operations - Version: March 2025 - 1.0"]
["MITIGATION OPTIONS"]
["A list of mitigation options which could be applied, and are included in the STEP 2 dropdown lists are given here. These can be amended, and more added."]
["Category","Sub-category","Options"]
["1. Climate trends","1.1 Vulnerability to wind storms, soil erosion","CT01. Review responses from community engagement on history of climate trends/incidents"]
["1. Climate trends","1.1 Vulnerability to wind storms, soil erosion","CT02. Monitor forecasts, early warning and extreme weather alerts"]
{"$rows_left_out":383}
{"sheet":"Compensation-Enhancement","index":12,"n_rows":36,"n_cols":7,"rows_kept":36,"cut":false,"hidden":false,"merged":[[3,1,3,6],[2,0,2,6]]}
["GREENFIELD TOOL: Mine Action and Disarmament Operations - Version: March 2025 - 1.0"]
["COMPENSATION OR ENHANCEMENT OPTIONS"]
["A list of compensation or enhancement options which could be applied to provide environmental benefits, and are included in the STEP 2 dropdown lists are given here. A 'benefit' category is also given, indicating how implementation could be make a positive impact. In some many cases, the benefits are multiple."]
[null,"Benefit category"]
["Options","Social value","Climate resilience","Conservation | biodiversity","Low carbon","Sustainable resource use","Pollution control |remediation|\nwaste management"]
["Awareness: Develop educational programs for project staff, local communities, and schools to raise awareness about environmental issues.","ü","ü",null,"``"]
{"$rows_left_out":31}
{"sheet":"Risk matrix","index":13,"n_rows":45,"n_cols":7,"rows_kept":45,"cut":false,"hidden":false,"merged":[[44,6,44,20],[41,6,41,20],[42,4,42,5],[42,6,42,20],[43,4,43,5],[43,6,43,20],[38,6,38,20],[39,1,39,3],[39,4,39,5],[39,6,39,20],[40,6,40,20],[35,6,35,20],[36,4,36,5],[36,6,36,20],[37,4,37,5],[37,6,37,20],[32,6,32,20],[33,1,33,3],[33,4,33,5],[33,6,33,20],[34,6,34,20],[27,1,27,3],[21,1,21,3],[22,1,22,3],[23,1,23,3],[27,4,27,5],[28,6,28,20],[30,4,30,5],[31,4,31,5],[21,4,21,20],[22,4,22,20],[23,4,23,20],[27,6,27,20],[29,6,29,20],[31,6,31,20],[30,6,30,20]]}
["GREENFIELD TOOL: Mine Action and Disarmament Operations - Version: March 2025 - 1.0"]
["RISK MATRIX"]
[]
[null,"The simplified matrix below is used to evaluate the level of risk. Risk is a function of 'severity' and the 'probability' of harm occurring"]
[]
[]
{"$rows_left_out":40}
{"sheet":"Response library","index":14,"n_rows":71,"n_cols":17,"rows_kept":71,"cut":false,"hidden":false,"merged":[]}
["GREENFIELD TOOL: Mine Action and Disarmament Operations - Version: March 2025 - 1.0"]
["RESPONSE LIBRARY","Note: The cells with Response options have 'defined names' and are linked to other sheets. Check these remain linked after any translation or any edits."]
["Response options provided in the dropdown lists"]
["Category","Response options"]
["General","Yes","No","Not known","Not relevant"]
["Border","Possible - within 10km","Unlikely - between 10-50km","Highly unlikely - more than 50km"]
{"$rows_left_out":66}
{"sheet":"Response calculation","index":15,"n_rows":400,"n_cols":38,"rows_kept":400,"cut":false,"hidden":true,"merged":[[0,1,0,3]]}
["Profile Statement","Note: this sheet has cells with 'defined names' and should update automatically if the Step 1 profile questions, the responses or the 'profile statements' are translated or text changed.",null,null,null,null,null,null,null,null,"Complementary Attribute #",{"$f":"J1+1","v":1},"Complementary Attribute #",{"$f":"L1+1","v":2},"Complementary Attribute #",{"$f":"N1+1","v":3},"Complementary Attribute #",{"$f":"P1+1","v":4},"Complementary Attribute #",{"$f":"R1+1","v":5},"Complementary Attribute #",{"$f":"T1+1","v":6},"Complementary Attribute #",{"$f":"V1+1","v":7},"Complementary Attribute #",{"$f":"X1+1","v":8},"Complementary Attribute #",{"$f":"Z1+1","v":9},"Complementary Attribute #",{"$f":"AB1+1","v":10},"Complementary Attribute #",{"$f":"AD1+1","v":11},"Complementary Attribute #",{"$f":"AF1+1","v":12},"Complementary Attribute #",{"$f":"AH1+1","v":13},"Complementary Attribute #",{"$f":"AJ1+1","v":14}]
[{"$f":"SS_populated_areas","v":"People living nearby, could be affected by negative mine action activities."},{"$f":"D3","v":0}]
[null,"Response value",null,{"$f":"IF(ISNA(VLOOKUP(D4,C5:D7,2,FALSE)),0,VLOOKUP(D4,C5:D7,2,FALSE))","v":0}]
[null,"Response",{"$f":"EP_Res_pop","v":"What is the distance of the area of operation to the nearest residential areas / populated area?"},{"$f":"INDEX('Step 1 Profile'!$G:$G,MATCH('Response calculation'!C4,'Step 1 Profile'!$B:$B,FALSE))","v":0}]
[null,null,{"$f":"Response_Pop_B_within_200m","v":"Within 200m"},1]
[null,null,{"$f":"Response_Pop_C_200m_to_500m","v":"Between 200m to 500m"},0.6]
{"$rows_left_out":395}
{"sheet":"Risk Matrix formulae","index":16,"n_rows":299,"n_cols":10,"rows_kept":299,"cut":false,"hidden":true,"merged":[]}
[null,"Note: formula is this sheet refers to cells with 'defined names', given in the Response Library under livelihood and severity."]
[null,"Likelihood 1","Likelihood 2","Likelihood 3","Likelihood 4","Severity 1","Severity 2","Severity 3","Severity - TOTAL","Risk"]
[null,{"$f":"IF('Step 2 EAM'!F8=Response_1._Unlikely, 1, 0)","v":0},{"$f":"IF('Step 2 EAM'!F8=Response_2._Low_likelihood, 2, 0)","v":0},{"$f":"IF('Step 2 EAM'!F8=Response_3._Likely, 3, 0)","v":0},{"$f":"SUM(B3:D3)","v":0},{"$f":"IF('Step 2 EAM'!G8=Response_1._Mild, 1, 0)","v":0},{"$f":"IF('Step 2 EAM'!G8=Response_2._Moderate,2, 0)","v":0},{"$f":"IF('Step 2 EAM'!G8=Response_3._Severe, 3, 0)","v":0},{"$f":"SUM(F3:H3)","v":0},{"$f":"I3*E3","v":0}]
[null,{"$f":"IF('Step 2 EAM'!F9=Response_1._Unlikely, 1, 0)","v":0},{"$f":"IF('Step 2 EAM'!F9=Response_2._Low_likelihood, 2, 0)","v":0},{"$f":"IF('Step 2 EAM'!F9=Response_3._Likely, 3, 0)","v":0},{"$f":"SUM(B4:D4)","v":0},{"$f":"IF('Step 2 EAM'!G9=Response_1._Mild, 1, 0)","v":0},{"$f":"IF('Step 2 EAM'!G9=Response_2._Moderate,2, 0)","v":0},{"$f":"IF('Step 2 EAM'!G9=Response_3._Severe, 3, 0)","v":0},{"$f":"SUM(F4:H4)","v":0},{"$f":"I4*E4","v":0}]
[null,{"$f":"IF('Step 2 EAM'!F10=Response_1._Unlikely, 1, 0)","v":0},{"$f":"IF('Step 2 EAM'!F10=Response_2._Low_likelihood, 2, 0)","v":0},{"$f":"IF('Step 2 EAM'!F10=Response_3._Likely, 3, 0)","v":0},0,{"$f":"IF('Step 2 EAM'!G10=Response_1._Mild, 1, 0)","v":0},{"$f":"IF('Step 2 EAM'!G10=Response_2._Moderate,2, 0)","v":0},{"$f":"IF('Step 2 EAM'!G10=Response_3._Severe, 3, 0)","v":0},0,0]
[null,{"$f":"IF('Step 2 EAM'!F11=Response_1._Unlikely, 1, 0)","v":0},{"$f":"IF('Step 2 EAM'!F11=Response_2._Low_likelihood, 2, 0)","v":0},{"$f":"IF('Step 2 EAM'!F11=Response_3._Likely, 3, 0)","v":0},0,{"$f":"IF('Step 2 EAM'!G11=Response_1._Mild, 1, 0)","v":0},{"$f":"IF('Step 2 EAM'!G11=Response_2._Moderate,2, 0)","v":0},{"$f":"IF('Step 2 EAM'!G11=Response_3._Severe, 3, 0)","v":0},0,0]
{"$rows_left_out":294}
{"sheet":"Profile Statements","index":17,"n_rows":68,"n_cols":22,"rows_kept":68,"cut":false,"hidden":true,"merged":[]}
["Profile Statement","Score","Category","Thresholds",null,null,null,null,null,null,null,null,null,null,null,null,null,null,null,null,null,"Mitigation Tips"]
[null,null,null,"High",0.75]
[null,null,null,"Medium",0.5]
["Note: If translating or editing the statements, only Column A needs to be changed. \nCells have 'defined names' and link to other sheets.",null,null,"Low",0.3]
["People living nearby, could be affected by negative mine action activities.",{"$f":"VLOOKUP(A5,'Response calculation'!A:B,2,FALSE)","v":0},{"$f":"IF(B5>$E$2,$D$2,IF(B5>$E$3,$D$3,IF(B5>$E$4,$D$4,\"Null\")))","v":"Null"},null,null,null,null,null,null,null,null,null,null,null,null,null,null,null,null,null,null,{"$f":"\"●   \"&_xlfn.TEXTJOIN(CHAR(10)&\"●   \",TRUE,F5:T5)","v":"●   "}]
["People with ready access to areas close to the mine action activities.",{"$f":"VLOOKUP(A6,'Response calculation'!A:B,2,FALSE)","v":0},"Null",null,null,null,null,null,null,null,null,null,null,null,null,null,null,null,null,null,null,"●   "]
{"$rows_left_out":62}